{"text_format":"1","workbook":"xlsx","n_sheets":3,"sheets":["Turnierplan 2024","Sheet1","Sheet2"],"not_rendered":{"charts":0,"images":0,"macros":1,"external_links":0,"defined_names":0,"comments":0,"pivot_tables":1},"unopened":[],"bounds":{"document_bytes":16777216,"sheet_cells":100000,"rows_first":2000,"rows_last":500,"rows_between":2000,"halvings":0,"cell_chars":16384,"cell_head_chars":4096},"cells_cut":0,"cells_raw":0,"read":"whole","date_system":"1900"}

{"sheet":"Turnierplan 2024","index":0,"n_rows":98,"n_cols":21,"rows_kept":98,"cut":false,"hidden":false,"merged":[[1,17,1,19],[1,16,2,16],[35,11,36,11],[18,1,18,5],[75,2,75,4],[49,7,50,7],[49,8,50,8],[49,9,50,9],[49,10,50,10],[49,11,50,11],[49,13,50,13],[42,7,43,7],[42,8,43,8],[42,9,43,9],[42,10,43,10],[42,11,43,11],[82,4,89,4],[90,4,93,4],[81,2,81,4],[19,1,20,6],[28,13,29,13],[35,7,36,7],[35,8,36,8],[35,9,36,9],[35,10,36,10],[35,13,36,13],[28,7,29,7],[28,8,29,8],[28,9,29,9],[28,10,29,10],[28,11,29,11],[42,13,43,13]]}
[]
[null,"#","Name","Rand","Gruppe","Gruppe (fix)","Startgeld bezahlt",null,"Row Labels",null,null,null,null,"Datum","2024-03-17",null,null,"Teilnehmer:",null,null,{"$f":"COUNTIF(C3:C18,\"<>FL*\")","v":15}]
[null,1,"Hubsi",{"$f":"RAND()","v":9.8527411411638233E-2},{"$f":"ROUNDUP(RANK(D3,$D$3:$D$18)/4,0)","v":4},2,null,null,1,null,null,null,null,"Beginn","13:00:00",null,null,{"$f":"16*20","v":320},"%",{"$f":"G19","v":0},"Adjusted"]
[null,2,"Noah",{"$f":"RAND()","v":0.37108183030018216},3,2,null,null,"FL1",null,null,null,null,"Ende","20:30:00",null,"Pott",{"$f":"16*5","v":80},"-",{"$f":"U2*5","v":75},{"$f":"T4","v":75}]
[null,3,"Sven",0.54057124931683731,3,3,null,null,"Christine",1,null,null,null,"Dauer",{"$f":"O4-O3","v":"07:30:00"},null,"Erster",100,{"$f":"R5/($R$3-$R$4)","v":0.41666666666666669},{"$f":"($T$3-$T$4)*S5","v":-31.25},94]
[null,4,"Wolfi",0.13039191426546293,4,4,null,null,"Noah",null,null,null,null,null,null,null,"Zweiter",80,{"$f":"R6/($R$3-$R$4)","v":0.33333333333333331},{"$f":"($T$3-$T$4)*S6","v":-25},75]
[null,5,"Alex",0.34599470977978097,3,2,null,null,"Sven","Gruppe 1","Gruppe 2",null,null,null,null,null,"Dritter",40,{"$f":"R7/($R$3-$R$4)","v":0.16666666666666666},{"$f":"($T$3-$T$4)*S7","v":-12.5},37]
[null,6,"Erwin",0.22291983838449791,4,1,null,null,2,{"$f":"I4","v":"FL1"},{"$f":"I9","v":"Erwin"},null,null,null,null,null,"Vierter",20,{"$f":"R8/($R$3-$R$4)","v":8.3333333333333329E-2},{"$f":"($T$3-$T$4)*S8","v":-6.25},19]
[null,7,"Bernd",2.3025127321556926E-2,4,1,null,null,"Erwin",{"$f":"I5","v":"Christine"},{"$f":"I10","v":"Bernd"},null,null,null,null,null,"Total",{"$f":"SUM(R4:R8)","v":320},null,{"$f":"SUM(T4:T8)","v":0},{"$f":"SUM(U4:U8)","v":300}]
[null,8,"Phil",0.73555079645926902,2,3,null,null,"Bernd",{"$f":"I6","v":"Noah"},{"$f":"I11","v":"Markus"},null,null,null,null,null,null,"16er Feld","%","Aktuell","Angepasst"]
[null,9,"Christine",0.58070383657087821,2,3,null,null,"Markus",{"$f":"I7","v":"Sven"},{"$f":"I12","v":"Felix"}]
[null,10,"Markus",{"$f":"RAND()","v":0.87542509865926965},1,1,null,null,"Felix","Gruppe 3","Gruppe 4"]
[null,11,"Joe",0.77462816722395855,1,3,null,null,3,{"$f":"I14","v":"Phil"},{"$f":"I19","v":"Hubsi"}]
[null,12,"Roger",0.49400290519835688,3,4,null,null,"Phil",{"$f":"I15","v":"Roger"},{"$f":"I20","v":"Joe"}]
[null,13,"Felix",0.6686702550717758,2,1,null,null,"Roger",{"$f":"I16","v":"Wolfi"},{"$f":"I21","v":"Andy"}]
[null,14,"Andy",0.64530630790076304,2,4,null,null,"Wolfi",{"$f":"I17","v":"Alex"},{"$f":"I22","v":"Harald"}]
[null,15,"Harald",0.76189215723164694,1,4,null,null,"Alex"]
[null,16,"FL1",0.81024922273741828,1,2,null,null,4]
[null,null,null,null,null,null,{"$f":"COUNTIF(G3:G18,\"X\")*20","v":0},null,"Hubsi"]
[null,"Manuell auszufüllen: Spieler (Spalte C), 'Platz' innerhalb der Gruppe (Spalte L), 'Gruppensieger' (Spalte N)",null,null,null,null,null,null,"Joe"]
[null,null,null,null,null,null,null,null,"Andy"]
[null,null,null,null,null,null,null,null,"Harald"]
[]
[]
[]
[]
[]
[]
[null,null,"Gruppe 1",null,null,null,null,"Gewonnene Spiele","Verlorene Spiele","Gewonnene Partien","Verlorene Partien","Platz\n(manuell)",null,"Gruppensieger\n(manuell)"]
[null,null,null,{"$f":"I4","v":"FL1"},{"$f":"I5","v":"Christine"},{"$f":"I6","v":"Noah"},{"$f":"I7","v":"Sven"}]
[null,null,{"$f":"I4","v":"FL1"},"-","","","",{"$f":"LEFT(E31,1) + LEFT(F31,1) + LEFT(G31,1)","v":{"$error":"#VALUE!"}},{"$f":"RIGHT(E31,1) + RIGHT(F31,1) + RIGHT(G31,1)","v":{"$error":"#VALUE!"}},{"$f":"IF(LEFT(E31,1)>RIGHT(E31,1),1,0)+IF(LEFT(F31,1)>RIGHT(F31,1),1,0)+IF(LEFT(G31,1)>RIGHT(G31,1),1,0)","v":0},{"$f":"IF(LEFT(E31,1)<RIGHT(E31,1),1,0)+IF(LEFT(F31,1)<RIGHT(F31,1),1,0)+IF(LEFT(G31,1)<RIGHT(G31,1),1,0)","v":0},null,null,"A","Erster G1"]
[null,null,{"$f":"I5","v":"Christine"},{"$f":"RIGHT(E31,1) & \":\" & LEFT(E31,1)","v":":"},"-","","",{"$f":"LEFT(D32,1) + LEFT(F32,1) + LEFT(G32,1)","v":{"$error":"#VALUE!"}},{"$f":"RIGHT(D32,1) + RIGHT(F32,1) + RIGHT(G32,1)","v":{"$error":"#VALUE!"}},{"$f":"IF(LEFT(D32,1)>RIGHT(D32,1),1,0)+IF(LEFT(F32,1)>RIGHT(F32,1),1,0)+IF(LEFT(G32,1)>RIGHT(G32,1),1,0)","v":0},{"$f":"IF(LEFT(D32,1)<RIGHT(D32,1),1,0)+IF(LEFT(F32,1)<RIGHT(F32,1),1,0)+IF(LEFT(G32,1)<RIGHT(G32,1),1,0)","v":0},null,null,"B","Zweiter G1"]
[null,null,{"$f":"I6","v":"Noah"},{"$f":"RIGHT(F31,1) & \":\" & LEFT(F31,1)","v":":"},{"$f":"RIGHT(F32,1) & \":\" & LEFT(F32,1)","v":":"},"-","",{"$f":"LEFT(D33,1) + LEFT(E33,1) + LEFT(G33,1)","v":{"$error":"#VALUE!"}},{"$f":"RIGHT(D33,1) + RIGHT(E33,1) + RIGHT(G33,1)","v":{"$error":"#VALUE!"}},{"$f":"IF(LEFT(D33,1)>RIGHT(D33,1),1,0)+IF(LEFT(E33,1)>RIGHT(E33,1),1,0)+IF(LEFT(G33,1)>RIGHT(G33,1),1,0)","v":0},{"$f":"IF(LEFT(D33,1)<RIGHT(D33,1),1,0)+IF(LEFT(E33,1)<RIGHT(E33,1),1,0)+IF(LEFT(G33,1)<RIGHT(G33,1),1,0)","v":0},null,null,"C","Ausgeschieden (1P)"]
[null,null,{"$f":"I7","v":"Sven"},{"$f":"RIGHT(G31,1) & \":\" & LEFT(G31,1)","v":":"},{"$f":"RIGHT(G32,1) & \":\" & LEFT(G32,1)","v":":"},{"$f":"RIGHT(G33,1) & \":\" & LEFT(G33,1)","v":":"},"-",{"$f":"LEFT(D34,1) + LEFT(E34,1) + LEFT(F34,1)","v":{"$error":"#VALUE!"}},{"$f":"RIGHT(D34,1) + RIGHT(E34,1) + RIGHT(F34,1)","v":{"$error":"#VALUE!"}},{"$f":"IF(LEFT(D34,1)>RIGHT(D34,1),1,0)+IF(LEFT(E34,1)>RIGHT(E34,1),1,0)+IF(LEFT(F34,1)>RIGHT(F34,1),1,0)","v":0},{"$f":"IF(LEFT(D34,1)<RIGHT(D34,1),1,0)+IF(LEFT(E34,1)<RIGHT(E34,1),1,0)+IF(LEFT(F34,1)<RIGHT(F34,1),1,0)","v":0},null,null,"D","Ausgeschieden (1P)"]
[]
[null,null,"Gruppe 2",null,null,null,null,"Gewonnene Spiele","Verlorene Spiele","Gewonnene Partien","Verlorene Partien","Platz\n(manuell)",null,"Gruppensieger\n(manuell)"]
[null,null,null,{"$f":"I9","v":"Erwin"},{"$f":"I10","v":"Bernd"},{"$f":"I11","v":"Markus"},{"$f":"I12","v":"Felix"}]
[null,null,{"$f":"I9","v":"Erwin"},"-","","","",{"$f":"LEFT(E38,1) + LEFT(F38,1) + LEFT(G38,1)","v":{"$error":"#VALUE!"}},{"$f":"RIGHT(E38,1) + RIGHT(F38,1) + RIGHT(G38,1)","v":{"$error":"#VALUE!"}},{"$f":"IF(LEFT(E38,1)>RIGHT(E38,1),1,0)+IF(LEFT(F38,1)>RIGHT(F38,1),1,0)+IF(LEFT(G38,1)>RIGHT(G38,1),1,0)","v":0},{"$f":"IF(LEFT(E38,1)<RIGHT(E38,1),1,0)+IF(LEFT(F38,1)<RIGHT(F38,1),1,0)+IF(LEFT(G38,1)<RIGHT(G38,1),1,0)","v":0},null,null,"E","Erster G2"]
[null,null,{"$f":"I10","v":"Bernd"},{"$f":"RIGHT(E38,1) & \":\" & LEFT(E38,1)","v":":"},"-","","",{"$f":"LEFT(D39,1) + LEFT(F39,1) + LEFT(G39,1)","v":{"$error":"#VALUE!"}},{"$f":"RIGHT(D39,1) + RIGHT(F39,1) + RIGHT(G39,1)","v":{"$error":"#VALUE!"}},{"$f":"IF(LEFT(D39,1)>RIGHT(D39,1),1,0)+IF(LEFT(F39,1)>RIGHT(F39,1),1,0)+IF(LEFT(G39,1)>RIGHT(G39,1),1,0)","v":0},{"$f":"IF(LEFT(D39,1)<RIGHT(D39,1),1,0)+IF(LEFT(F39,1)<RIGHT(F39,1),1,0)+IF(LEFT(G39,1)<RIGHT(G39,1),1,0)","v":0},null,null,"F","Zweiter G2"]
[null,null,{"$f":"I11","v":"Markus"},{"$f":"RIGHT(F38,1) & \":\" & LEFT(F38,1)","v":":"},{"$f":"RIGHT(F39,1) & \":\" & LEFT(F39,1)","v":":"},"-","",{"$f":"LEFT(D40,1) + LEFT(E40,1) + LEFT(G40,1)","v":{"$error":"#VALUE!"}},{"$f":"RIGHT(D40,1) + RIGHT(E40,1) + RIGHT(G40,1)","v":{"$error":"#VALUE!"}},{"$f":"IF(LEFT(D40,1)>RIGHT(D40,1),1,0)+IF(LEFT(E40,1)>RIGHT(E40,1),1,0)+IF(LEFT(G40,1)>RIGHT(G40,1),1,0)","v":0},{"$f":"IF(LEFT(D40,1)<RIGHT(D40,1),1,0)+IF(LEFT(E40,1)<RIGHT(E40,1),1,0)+IF(LEFT(G40,1)<RIGHT(G40,1),1,0)","v":0},null,null,"G","Ausgeschieden (1P)"]
[null,null,{"$f":"I12","v":"Felix"},{"$f":"RIGHT(G38,1) & \":\" & LEFT(G38,1)","v":":"},{"$f":"RIGHT(G39,1) & \":\" & LEFT(G39,1)","v":":"},{"$f":"RIGHT(G40,1) & \":\" & LEFT(G40,1)","v":":"},"-",{"$f":"LEFT(D41,1) + LEFT(E41,1) + LEFT(F41,1)","v":{"$error":"#VALUE!"}},{"$f":"RIGHT(D41,1) + RIGHT(E41,1) + RIGHT(F41,1)","v":{"$error":"#VALUE!"}},{"$f":"IF(LEFT(D41,1)>RIGHT(D41,1),1,0)+IF(LEFT(E41,1)>RIGHT(E41,1),1,0)+IF(LEFT(F41,1)>RIGHT(F41,1),1,0)","v":0},{"$f":"IF(LEFT(D41,1)<RIGHT(D41,1),1,0)+IF(LEFT(E41,1)<RIGHT(E41,1),1,0)+IF(LEFT(F41,1)<RIGHT(F41,1),1,0)","v":0},null,null,"H","Ausgeschieden (1P)"]
[]
[null,null,"Gruppe 3",null,null,null,null,"Gewonnene Spiele","Verlorene Spiele","Gewonnene Partien","Verlorene Partien","Platz\n(manuell)",null,"Gruppensieger\n(manuell)"]
[null,null,null,{"$f":"I14","v":"Phil"},{"$f":"I15","v":"Roger"},{"$f":"I16","v":"Wolfi"},{"$f":"I17","v":"Alex"}]
[null,null,{"$f":"I14","v":"Phil"},"-","","","",{"$f":"LEFT(E45,1) + LEFT(F45,1) + LEFT(G45,1)","v":{"$error":"#VALUE!"}},{"$f":"RIGHT(E45,1) + RIGHT(F45,1) + RIGHT(G45,1)","v":{"$error":"#VALUE!"}},{"$f":"IF(LEFT(E45,1)>RIGHT(E45,1),1,0)+IF(LEFT(F45,1)>RIGHT(F45,1),1,0)+IF(LEFT(G45,1)>RIGHT(G45,1),1,0)","v":0},{"$f":"IF(LEFT(E45,1)<RIGHT(E45,1),1,0)+IF(LEFT(F45,1)<RIGHT(F45,1),1,0)+IF(LEFT(G45,1)<RIGHT(G45,1),1,0)","v":0},null,null,"I","Erster G3"]
[null,null,{"$f":"I15","v":"Roger"},{"$f":"RIGHT(E45,1) & \":\" & LEFT(E45,1)","v":":"},"-","","",{"$f":"LEFT(D46,1) + LEFT(F46,1) + LEFT(G46,1)","v":{"$error":"#VALUE!"}},{"$f":"RIGHT(D46,1) + RIGHT(F46,1) + RIGHT(G46,1)","v":{"$error":"#VALUE!"}},{"$f":"IF(LEFT(D46,1)>RIGHT(D46,1),1,0)+IF(LEFT(F46,1)>RIGHT(F46,1),1,0)+IF(LEFT(G46,1)>RIGHT(G46,1),1,0)","v":0},{"$f":"IF(LEFT(D46,1)<RIGHT(D46,1),1,0)+IF(LEFT(F46,1)<RIGHT(F46,1),1,0)+IF(LEFT(G46,1)<RIGHT(G46,1),1,0)","v":0},null,null,"J","Zweiter G3"]
[null,null,{"$f":"I16","v":"Wolfi"},{"$f":"RIGHT(F45,1) & \":\" & LEFT(F45,1)","v":":"},{"$f":"RIGHT(F46,1) & \":\" & LEFT(F46,1)","v":":"},"-","",{"$f":"LEFT(D47,1) + LEFT(E47,1) + LEFT(G47,1)","v":{"$error":"#VALUE!"}},{"$f":"RIGHT(D47,1) + RIGHT(E47,1) + RIGHT(G47,1)","v":{"$error":"#VALUE!"}},{"$f":"IF(LEFT(D47,1)>RIGHT(D47,1),1,0)+IF(LEFT(E47,1)>RIGHT(E47,1),1,0)+IF(LEFT(G47,1)>RIGHT(G47,1),1,0)","v":0},{"$f":"IF(LEFT(D47,1)<RIGHT(D47,1),1,0)+IF(LEFT(E47,1)<RIGHT(E47,1),1,0)+IF(LEFT(G47,1)<RIGHT(G47,1),1,0)","v":0},null,null,"K","Ausgeschieden (1P)"]
[null,null,{"$f":"I17","v":"Alex"},{"$f":"RIGHT(G45,1) & \":\" & LEFT(G45,1)","v":":"},{"$f":"RIGHT(G46,1) & \":\" & LEFT(G46,1)","v":":"},{"$f":"RIGHT(G47,1) & \":\" & LEFT(G47,1)","v":":"},"-",{"$f":"LEFT(D48,1) + LEFT(E48,1) + LEFT(F48,1)","v":{"$error":"#VALUE!"}},{"$f":"RIGHT(D48,1) + RIGHT(E48,1) + RIGHT(F48,1)","v":{"$error":"#VALUE!"}},{"$f":"IF(LEFT(D48,1)>RIGHT(D48,1),1,0)+IF(LEFT(E48,1)>RIGHT(E48,1),1,0)+IF(LEFT(F48,1)>RIGHT(F48,1),1,0)","v":0},{"$f":"IF(LEFT(D48,1)<RIGHT(D48,1),1,0)+IF(LEFT(E48,1)<RIGHT(E48,1),1,0)+IF(LEFT(F48,1)<RIGHT(F48,1),1,0)","v":0},null,null,"L","Ausgeschieden (1P)"]
[]
[null,null,"Gruppe 4",null,null,null,null,"Gewonnene Spiele","Verlorene Spiele","Gewonnene Partien","Verlorene Partien","Platz\n(manuell)",null,"Gruppensieger\n(manuell)"]
[null,null,null,{"$f":"I19","v":"Hubsi"},{"$f":"I20","v":"Joe"},{"$f":"I21","v":"Andy"},{"$f":"I22","v":"Harald"}]
[null,null,{"$f":"I19","v":"Hubsi"},"-","","","",{"$f":"LEFT(E52,1) + LEFT(F52,1) + LEFT(G52,1)","v":{"$error":"#VALUE!"}},{"$f":"RIGHT(E52,1) + RIGHT(F52,1) + RIGHT(G52,1)","v":{"$error":"#VALUE!"}},{"$f":"IF(LEFT(E52,1)>RIGHT(E52,1),1,0)+IF(LEFT(F52,1)>RIGHT(F52,1),1,0)+IF(LEFT(G52,1)>RIGHT(G52,1),1,0)","v":0},{"$f":"IF(LEFT(E52,1)<RIGHT(E52,1),1,0)+IF(LEFT(F52,1)<RIGHT(F52,1),1,0)+IF(LEFT(G52,1)<RIGHT(G52,1),1,0)","v":0},null,null,"M","Erster G4"]
[null,null,{"$f":"I20","v":"Joe"},{"$f":"RIGHT(E52,1) & \":\" & LEFT(E52,1)","v":":"},"-","","",{"$f":"LEFT(D53,1) + LEFT(F53,1) + LEFT(G53,1)","v":{"$error":"#VALUE!"}},{"$f":"RIGHT(D53,1) + RIGHT(F53,1) + RIGHT(G53,1)","v":{"$error":"#VALUE!"}},{"$f":"IF(LEFT(D53,1)>RIGHT(D53,1),1,0)+IF(LEFT(F53,1)>RIGHT(F53,1),1,0)+IF(LEFT(G53,1)>RIGHT(G53,1),1,0)","v":0},{"$f":"IF(LEFT(D53,1)<RIGHT(D53,1),1,0)+IF(LEFT(F53,1)<RIGHT(F53,1),1,0)+IF(LEFT(G53,1)<RIGHT(G53,1),1,0)","v":0},null,null,"N","Zweiter G4"]
[null,null,{"$f":"I21","v":"Andy"},{"$f":"RIGHT(F52,1) & \":\" & LEFT(F52,1)","v":":"},{"$f":"RIGHT(F53,1) & \":\" & LEFT(F53,1)","v":":"},"-","",{"$f":"LEFT(D54,1) + LEFT(E54,1) + LEFT(G54,1)","v":{"$error":"#VALUE!"}},{"$f":"RIGHT(D54,1) + RIGHT(E54,1) + RIGHT(G54,1)","v":{"$error":"#VALUE!"}},{"$f":"IF(LEFT(D54,1)>RIGHT(D54,1),1,0)+IF(LEFT(E54,1)>RIGHT(E54,1),1,0)+IF(LEFT(G54,1)>RIGHT(G54,1),1,0)","v":0},{"$f":"IF(LEFT(D54,1)<RIGHT(D54,1),1,0)+IF(LEFT(E54,1)<RIGHT(E54,1),1,0)+IF(LEFT(G54,1)<RIGHT(G54,1),1,0)","v":0},null,null,"O","Ausgeschieden (1P)"]
[null,null,{"$f":"I22","v":"Harald"},{"$f":"RIGHT(G52,1) & \":\" & LEFT(G52,1)","v":":"},{"$f":"RIGHT(G53,1) & \":\" & LEFT(G53,1)","v":":"},{"$f":"RIGHT(G54,1) & \":\" & LEFT(G54,1)","v":":"},"-",{"$f":"LEFT(D55,1) + LEFT(E55,1) + LEFT(F55,1)","v":{"$error":"#VALUE!"}},{"$f":"RIGHT(D55,1) + RIGHT(E55,1) + RIGHT(F55,1)","v":{"$error":"#VALUE!"}},{"$f":"IF(LEFT(D55,1)>RIGHT(D55,1),1,0)+IF(LEFT(E55,1)>RIGHT(E55,1),1,0)+IF(LEFT(F55,1)>RIGHT(F55,1),1,0)","v":0},{"$f":"IF(LEFT(D55,1)<RIGHT(D55,1),1,0)+IF(LEFT(E55,1)<RIGHT(E55,1),1,0)+IF(LEFT(F55,1)<RIGHT(F55,1),1,0)","v":0},null,null,"P","Ausgeschieden (1P)"]
[]
[]
[null,null,"Letzte 8",null,"Spieler 1","Spieler 2","Ergebnis","Gewinner (1-4)","Verlierer (5-8 / 2P)"]
[null,"A","Erster G1","Zweiter G4",{"$f":"N31","v":"A"},{"$f":"N53","v":"N"},"4:2",{"$f":"IF(G59=\"\",\"\",IF(LEFT(G59,1)>RIGHT(G59,1),E59,F59))","v":"A"},{"$f":"IF(G59=\"\",\"\",IF(LEFT(G59,1)>RIGHT(G59,1),F59,E59))","v":"N"}]
[null,"B","Erster G2","Zweiter G3",{"$f":"N38","v":"E"},{"$f":"N46","v":"J"},"4:2",{"$f":"IF(G60=\"\",\"\",IF(LEFT(G60,1)>RIGHT(G60,1),E60,F60))","v":"E"},{"$f":"IF(G60=\"\",\"\",IF(LEFT(G60,1)>RIGHT(G60,1),F60,E60))","v":"J"}]
[null,"C","Erster G3","Zweiter G2",{"$f":"N45","v":"I"},{"$f":"N39","v":"F"},"4:2",{"$f":"IF(G61=\"\",\"\",IF(LEFT(G61,1)>RIGHT(G61,1),E61,F61))","v":"I"},{"$f":"IF(G61=\"\",\"\",IF(LEFT(G61,1)>RIGHT(G61,1),F61,E61))","v":"F"}]
[null,"D","Erster G4","Zweiter G1",{"$f":"N52","v":"M"},{"$f":"N32","v":"B"},"4:2",{"$f":"IF(G62=\"\",\"\",IF(LEFT(G62,1)>RIGHT(G62,1),E62,F62))","v":"M"},{"$f":"IF(G62=\"\",\"\",IF(LEFT(G62,1)>RIGHT(G62,1),F62,E62))","v":"B"}]
[]
[null,null,"Letzte 4",null,"Spieler 1","Spieler 2","Ergebnis","Gewinner (1/2)","Verlierer (3/4)"]
[null,"X","Gewinner A","Gewinner B",{"$f":"H59","v":"A"},{"$f":"H60","v":"E"},"4:2",{"$f":"IF(G65=\"\",\"\",IF(LEFT(G65,1)>RIGHT(G65,1),E65,F65))","v":"A"},{"$f":"IF(G65=\"\",\"\",IF(LEFT(G65,1)>RIGHT(G65,1),F65,E65))","v":"E"}]
[null,"Y","Gewinner C","Gewinner D",{"$f":"H61","v":"I"},{"$f":"H62","v":"M"},"4:2",{"$f":"IF(G66=\"\",\"\",IF(LEFT(G66,1)>RIGHT(G66,1),E66,F66))","v":"I"},{"$f":"IF(G66=\"\",\"\",IF(LEFT(G66,1)>RIGHT(G66,1),F66,E66))","v":"M"}]
[]
[null,null,"Platz 1 & 2",null,"Spieler 1","Spieler 2","Ergebnis","Gewinner (6P)","Verlierer (5P)"]
[null,null,"Gewinner X","Gewinner Y",{"$f":"H65","v":"A"},{"$f":"H66","v":"I"},"4:2",{"$f":"IF(G69=\"\",\"\",IF(LEFT(G69,1)>RIGHT(G69,1),E69,F69))","v":"A"},{"$f":"IF(G69=\"\",\"\",IF(LEFT(G69,1)>RIGHT(G69,1),F69,E69))","v":"I"}]
[]
[null,null,"Platz 3 & 4",null,"Spieler 1","Spieler 2","Ergebnis","Gewinner (4P)","Verlierer (3P)"]
[null,null,"Verlierer X","Verlierer Y",{"$f":"I65","v":"E"},{"$f":"I66","v":"M"},"4:2",{"$f":"IF(G72=\"\",\"\",IF(LEFT(G72,1)>RIGHT(G72,1),E72,F72))","v":"E"},{"$f":"IF(G72=\"\",\"\",IF(LEFT(G72,1)>RIGHT(G72,1),F72,E72))","v":"M"}]
[]
[]
[]
[null,null,"Platzierung & Preisgeld"]
[null,null,"Erster Platz ",{"$f":"H69","v":"A"},{"$f":"U5","v":94}]
[null,null,"Zweiter Platz",{"$f":"I69","v":"I"},{"$f":"U6","v":75}]
[null,null,"Dritter Platz",{"$f":"H72","v":"E"},{"$f":"U7","v":37}]
[null,null,"Vierter Platz",{"$f":"I72","v":"M"},{"$f":"U8","v":19}]
[]
[null,null,"Punkte der Teilnehmer"]
[null,null,{"$f":"N33","v":"C"},1,"Teilnahme"]
[null,null,{"$f":"N34","v":"D"},1]
[null,null,{"$f":"N40","v":"G"},1]
[null,null,{"$f":"N41","v":"H"},1]
[null,null,{"$f":"N47","v":"K"},1]
[null,null,{"$f":"N48","v":"L"},1]
[null,null,{"$f":"N54","v":"O"},1]
[null,null,{"$f":"N55","v":"P"},1]
[null,null,{"$f":"I59","v":"N"},2,"Letzte 8"]
[null,null,{"$f":"I60","v":"J"},2]
[null,null,{"$f":"I61","v":"F"},2]
[null,null,{"$f":"I62","v":"B"},2]
[null,null,{"$f":"I72","v":"M"},3,"Vierter"]
[null,null,{"$f":"H72","v":"E"},4,"Dritter"]
[null,null,{"$f":"I69","v":"I"},5,"Zweiter"]
[null,null,{"$f":"H69","v":"A"},6,"Erster"]

{"sheet":"Sheet1","index":1,"n_rows":14,"n_cols":1,"rows_kept":14,"cut":false,"hidden":false,"merged":[]}
["Begrüßung"]
[]
["Herzlich Willkommen"]
["Drittes Jahr - erstes Turnier im März"]
["Danke vom 6Pocket - und von mir persönlich"]
["Änderungen zum letzten Jahr:"]
["- IMMER 10er Ball, 4 Gewinnspiele, Wechselbreak"]
["- IMMER Gruppenphase bis 8 übrig sind, dann Einzel-KO"]
["- 20€ Startgebühr, 5€ in Pott für Dezember-Turnier"]
["Was bleibt gleich:"]
["- Punkte für Teilnahme & Platzierung (6/5/4/3 // 2 // 1"]
["- Anmeldung über 6pocket.de"]
["Sven ab 14.00 Uhr"]
["Auslosung - Zahl zwischen 1 und 10"]

{"sheet":"Sheet2","index":2,"n_rows":5,"n_cols":1,"rows_kept":5,"cut":false,"hidden":false,"merged":[]}
["Verbesserungen"]
[]
["Spiele gestartet / fertig"]
[]
["Tisch für Partien nach Gruppen-Phase"]