{"text_format":"1","workbook":"xlsx","n_sheets":3,"sheets":["Turnierplan 2024","Sheet1","Sheet2"],"not_rendered":{"charts":0,"images":0,"macros":1,"external_links":0,"defined_names":0,"comments":0,"pivot_tables":1},"unopened":[],"bounds":{"document_bytes":16777216,"sheet_cells":100000,"rows_first":2000,"rows_last":500,"rows_between":2000,"halvings":0,"cell_chars":16384,"cell_head_chars":4096},"cells_cut":0,"cells_raw":0,"read":"whole","date_system":"1900"}

{"sheet":"Turnierplan 2024","index":0,"n_rows":98,"n_cols":21,"rows_kept":98,"cut":false,"hidden":false,"merged":[[82,4,89,4],[90,4,93,4],[81,2,81,4],[19,1,20,6],[28,13,29,13],[35,7,36,7],[35,8,36,8],[35,9,36,9],[35,10,36,10],[35,13,36,13],[28,7,29,7],[28,8,29,8],[28,9,29,9],[28,10,29,10],[28,11,29,11],[42,13,43,13],[1,17,1,19],[1,16,2,16],[35,11,36,11],[18,1,18,5],[75,2,75,4],[49,7,50,7],[49,8,50,8],[49,9,50,9],[49,10,50,10],[49,11,50,11],[49,13,50,13],[42,7,43,7],[42,8,43,8],[42,9,43,9],[42,10,43,10],[42,11,43,11]]}
[]
[null,"#","Name","Rand","Gruppe","Gruppe (fix)","Startgeld bezahlt",null,"Row Labels",null,null,null,null,"Datum","2024-04-14",null,null,"Teilnehmer:",null,null,{"$f":"COUNTIF(C3:C18,\"<>FL*\")","v":11}]
[null,1,"Christian Hubmann",{"$f":"RAND()","v":0.10034533506455878},{"$f":"ROUNDUP(RANK(D3,$D$3:$D$18)/4,0)","v":4},4,"x",null,1,null,null,null,null,"Beginn","13:00:00",null,null,{"$f":"16*20","v":320},"%",{"$f":"G19","v":220},"Adjusted"]
[null,2,"Philipp Grau",{"$f":"RAND()","v":0.75248214807774894},1,3,"x",null,"FL3",null,null,null,null,"Ende","19:00:00",null,"Pott",{"$f":"16*5","v":80},"-",{"$f":"U2*5","v":55},{"$f":"T4","v":55}]
[null,3,"Christine Neuhierl",0.48496923012485016,2,2,"x",null,"FL5",6,null,null,null,"Dauer",{"$f":"O4-O3","v":"06:00:00"},null,"Erster",100,{"$f":"R5/($R$3-$R$4)","v":0.41666666666666669},{"$f":"($T$3-$T$4)*S5","v":68.75},70]
[null,4,"Harald Fröhlich",0.37214569931617891,3,3,"x",null,"Noah Pülhorn",null,null,null,null,null,null,null,"Zweiter",80,{"$f":"R6/($R$3-$R$4)","v":0.33333333333333331},{"$f":"($T$3-$T$4)*S6","v":55},50]
[null,5,"Bernd Jahnke",0.47803215899922058,3,3,"x",null,"Christian Hubmann","Gruppe 1","Gruppe 2",null,null,null,null,null,"Dritter",40,{"$f":"R7/($R$3-$R$4)","v":0.16666666666666666},{"$f":"($T$3-$T$4)*S7","v":27.5},30]
[null,6,"Monika Preuß",0.41105714709204511,3,1,"x",null,2,{"$f":"I4","v":"FL3"},{"$f":"I9","v":"FL2"},null,null,null,null,null,"Vierter",20,{"$f":"R8/($R$3-$R$4)","v":8.3333333333333329E-2},{"$f":"($T$3-$T$4)*S8","v":13.75},15]
[null,7,"Wolfgang Schuhmann",0.70654160680925981,2,1,"x",null,"FL2",{"$f":"I5","v":"FL5"},{"$f":"I10","v":"Harald Fröhlich"},null,null,null,null,null,"Total",{"$f":"SUM(R4:R8)","v":320},null,{"$f":"SUM(T4:T8)","v":220},{"$f":"SUM(U4:U8)","v":220}]
[null,8,"Rosca Angelo",0.83718957745342892,1,2,"x",null,"Harald Fröhlich",{"$f":"I6","v":"Noah Pülhorn"},{"$f":"I11","v":"Monika Preuß"},null,null,null,null,null,null,"16er Feld","%","Aktuell","Angepasst"]
[null,9,"Rosca Leo",0.29430596946717069,4,2,"x",null,"Monika Preuß",{"$f":"I7","v":"Christian Hubmann"},{"$f":"I12","v":"Wolfgang Schuhmann"}]
[null,10,"Rosca Daniel",{"$f":"RAND()","v":0.47983676607691361},2,4,"x",null,"Wolfgang Schuhmann","Gruppe 3","Gruppe 4"]
[null,11,"Noah Pülhorn",0.69843632315679283,2,3,"x",null,3,{"$f":"I14","v":"FL4"},{"$f":"I19","v":"FL1"}]
[null,12,"FL1",0.7660917230838965,1,1,null,null,"FL4",{"$f":"I15","v":"Philipp Grau"},{"$f":"I20","v":"Bernd Jahnke"}]
[null,13,"FL2",0.23536268073153022,4,4,null,null,"Philipp Grau",{"$f":"I16","v":"Rosca Angelo"},{"$f":"I21","v":"Christine Neuhierl"}]
[null,14,"FL3",0.37857650829479994,3,4,null,null,"Rosca Angelo",{"$f":"I17","v":"Rosca Leo"},{"$f":"I22","v":"Rosca Daniel"}]
[null,15,"FL4",0.12747179457350766,4,2,null,null,"Rosca Leo"]
[null,16,"FL5",0.9712890250795253,1,1,null,null,4]
[null,null,null,null,null,null,{"$f":"COUNTIF(G3:G18,\"X\")*20","v":220},null,"FL1"]
[null,"Manuell auszufüllen: Spieler (Spalte C), 'Platz' innerhalb der Gruppe (Spalte L), 'Gruppensieger' (Spalte N)",null,null,null,null,null,null,"Bernd Jahnke"]
[null,null,null,null,null,null,null,null,"Christine Neuhierl"]
[null,null,null,null,null,null,null,null,"Rosca Daniel"]
[]
[]
[]
[]
[]
[]
[null,null,"Gruppe 1",null,null,null,null,"Gewonnene Spiele","Verlorene Spiele","Gewonnene Partien","Verlorene Partien","Platz\n(manuell)",null,"Gruppensieger\n(manuell)"]
[null,null,null,{"$f":"I4","v":"FL3"},{"$f":"I5","v":"FL5"},{"$f":"I6","v":"Noah Pülhorn"},{"$f":"I7","v":"Christian Hubmann"}]
[null,null,{"$f":"I4","v":"FL3"},"-","0:4","0:4","0:4",{"$f":"LEFT(E31,1) + LEFT(F31,1) + LEFT(G31,1)","v":0},{"$f":"RIGHT(E31,1) + RIGHT(F31,1) + RIGHT(G31,1)","v":12},{"$f":"IF(LEFT(E31,1)>RIGHT(E31,1),1,0)+IF(LEFT(F31,1)>RIGHT(F31,1),1,0)+IF(LEFT(G31,1)>RIGHT(G31,1),1,0)","v":0},{"$f":"IF(LEFT(E31,1)<RIGHT(E31,1),1,0)+IF(LEFT(F31,1)<RIGHT(F31,1),1,0)+IF(LEFT(G31,1)<RIGHT(G31,1),1,0)","v":3},4,null,"Christian Hubmann","Erster G1"]
[null,null,{"$f":"I5","v":"FL5"},{"$f":"RIGHT(E31,1) & \":\" & LEFT(E31,1)","v":"4:0"},"-","0:4","0:4",{"$f":"LEFT(D32,1) + LEFT(F32,1) + LEFT(G32,1)","v":4},{"$f":"RIGHT(D32,1) + RIGHT(F32,1) + RIGHT(G32,1)","v":8},{"$f":"IF(LEFT(D32,1)>RIGHT(D32,1),1,0)+IF(LEFT(F32,1)>RIGHT(F32,1),1,0)+IF(LEFT(G32,1)>RIGHT(G32,1),1,0)","v":1},{"$f":"IF(LEFT(D32,1)<RIGHT(D32,1),1,0)+IF(LEFT(F32,1)<RIGHT(F32,1),1,0)+IF(LEFT(G32,1)<RIGHT(G32,1),1,0)","v":2},3,null,"Noah Pülhorn","Zweiter G1"]
[null,null,{"$f":"I6","v":"Noah Pülhorn"},{"$f":"RIGHT(F31,1) & \":\" & LEFT(F31,1)","v":"4:0"},{"$f":"RIGHT(F32,1) & \":\" & LEFT(F32,1)","v":"4:0"},"-","3:4",{"$f":"LEFT(D33,1) + LEFT(E33,1) + LEFT(G33,1)","v":11},{"$f":"RIGHT(D33,1) + RIGHT(E33,1) + RIGHT(G33,1)","v":4},{"$f":"IF(LEFT(D33,1)>RIGHT(D33,1),1,0)+IF(LEFT(E33,1)>RIGHT(E33,1),1,0)+IF(LEFT(G33,1)>RIGHT(G33,1),1,0)","v":2},{"$f":"IF(LEFT(D33,1)<RIGHT(D33,1),1,0)+IF(LEFT(E33,1)<RIGHT(E33,1),1,0)+IF(LEFT(G33,1)<RIGHT(G33,1),1,0)","v":1},2,null,"FL3","Ausgeschieden (1P)"]
[null,null,{"$f":"I7","v":"Christian Hubmann"},{"$f":"RIGHT(G31,1) & \":\" & LEFT(G31,1)","v":"4:0"},{"$f":"RIGHT(G32,1) & \":\" & LEFT(G32,1)","v":"4:0"},{"$f":"RIGHT(G33,1) & \":\" & LEFT(G33,1)","v":"4:3"},"-",{"$f":"LEFT(D34,1) + LEFT(E34,1) + LEFT(F34,1)","v":12},{"$f":"RIGHT(D34,1) + RIGHT(E34,1) + RIGHT(F34,1)","v":3},{"$f":"IF(LEFT(D34,1)>RIGHT(D34,1),1,0)+IF(LEFT(E34,1)>RIGHT(E34,1),1,0)+IF(LEFT(F34,1)>RIGHT(F34,1),1,0)","v":3},{"$f":"IF(LEFT(D34,1)<RIGHT(D34,1),1,0)+IF(LEFT(E34,1)<RIGHT(E34,1),1,0)+IF(LEFT(F34,1)<RIGHT(F34,1),1,0)","v":0},1,null,"FL5","Ausgeschieden (1P)"]
[]
[null,null,"Gruppe 2",null,null,null,null,"Gewonnene Spiele","Verlorene Spiele","Gewonnene Partien","Verlorene Partien","Platz\n(manuell)",null,"Gruppensieger\n(manuell)"]
[null,null,null,{"$f":"I9","v":"FL2"},{"$f":"I10","v":"Harald Fröhlich"},{"$f":"I11","v":"Monika Preuß"},{"$f":"I12","v":"Wolfgang Schuhmann"}]
[null,null,{"$f":"I9","v":"FL2"},"-","0:4","0:4","0:4",{"$f":"LEFT(E38,1) + LEFT(F38,1) + LEFT(G38,1)","v":0},{"$f":"RIGHT(E38,1) + RIGHT(F38,1) + RIGHT(G38,1)","v":12},{"$f":"IF(LEFT(E38,1)>RIGHT(E38,1),1,0)+IF(LEFT(F38,1)>RIGHT(F38,1),1,0)+IF(LEFT(G38,1)>RIGHT(G38,1),1,0)","v":0},{"$f":"IF(LEFT(E38,1)<RIGHT(E38,1),1,0)+IF(LEFT(F38,1)<RIGHT(F38,1),1,0)+IF(LEFT(G38,1)<RIGHT(G38,1),1,0)","v":3},4,null,"Wolfgang Schuhmann","Erster G2"]
[null,null,{"$f":"I10","v":"Harald Fröhlich"},{"$f":"RIGHT(E38,1) & \":\" & LEFT(E38,1)","v":"4:0"},"-","4:2","1:4",{"$f":"LEFT(D39,1) + LEFT(F39,1) + LEFT(G39,1)","v":9},{"$f":"RIGHT(D39,1) + RIGHT(F39,1) + RIGHT(G39,1)","v":6},{"$f":"IF(LEFT(D39,1)>RIGHT(D39,1),1,0)+IF(LEFT(F39,1)>RIGHT(F39,1),1,0)+IF(LEFT(G39,1)>RIGHT(G39,1),1,0)","v":2},{"$f":"IF(LEFT(D39,1)<RIGHT(D39,1),1,0)+IF(LEFT(F39,1)<RIGHT(F39,1),1,0)+IF(LEFT(G39,1)<RIGHT(G39,1),1,0)","v":1},2,null,"Harald Fröhlich","Zweiter G2"]
[null,null,{"$f":"I11","v":"Monika Preuß"},{"$f":"RIGHT(F38,1) & \":\" & LEFT(F38,1)","v":"4:0"},{"$f":"RIGHT(F39,1) & \":\" & LEFT(F39,1)","v":"2:4"},"-","1:4",{"$f":"LEFT(D40,1) + LEFT(E40,1) + LEFT(G40,1)","v":7},{"$f":"RIGHT(D40,1) + RIGHT(E40,1) + RIGHT(G40,1)","v":8},{"$f":"IF(LEFT(D40,1)>RIGHT(D40,1),1,0)+IF(LEFT(E40,1)>RIGHT(E40,1),1,0)+IF(LEFT(G40,1)>RIGHT(G40,1),1,0)","v":1},{"$f":"IF(LEFT(D40,1)<RIGHT(D40,1),1,0)+IF(LEFT(E40,1)<RIGHT(E40,1),1,0)+IF(LEFT(G40,1)<RIGHT(G40,1),1,0)","v":2},3,null,"Monika Preuß","Ausgeschieden (1P)"]
[null,null,{"$f":"I12","v":"Wolfgang Schuhmann"},{"$f":"RIGHT(G38,1) & \":\" & LEFT(G38,1)","v":"4:0"},{"$f":"RIGHT(G39,1) & \":\" & LEFT(G39,1)","v":"4:1"},{"$f":"RIGHT(G40,1) & \":\" & LEFT(G40,1)","v":"4:1"},"-",{"$f":"LEFT(D41,1) + LEFT(E41,1) + LEFT(F41,1)","v":12},{"$f":"RIGHT(D41,1) + RIGHT(E41,1) + RIGHT(F41,1)","v":2},{"$f":"IF(LEFT(D41,1)>RIGHT(D41,1),1,0)+IF(LEFT(E41,1)>RIGHT(E41,1),1,0)+IF(LEFT(F41,1)>RIGHT(F41,1),1,0)","v":3},{"$f":"IF(LEFT(D41,1)<RIGHT(D41,1),1,0)+IF(LEFT(E41,1)<RIGHT(E41,1),1,0)+IF(LEFT(F41,1)<RIGHT(F41,1),1,0)","v":0},1,null,"FL2","Ausgeschieden (1P)"]
[]
[null,null,"Gruppe 3",null,null,null,null,"Gewonnene Spiele","Verlorene Spiele","Gewonnene Partien","Verlorene Partien","Platz\n(manuell)",null,"Gruppensieger\n(manuell)"]
[null,null,null,{"$f":"I14","v":"FL4"},{"$f":"I15","v":"Philipp Grau"},{"$f":"I16","v":"Rosca Angelo"},{"$f":"I17","v":"Rosca Leo"}]
[null,null,{"$f":"I14","v":"FL4"},"-","0:4","0:4","0:4",{"$f":"LEFT(E45,1) + LEFT(F45,1) + LEFT(G45,1)","v":0},{"$f":"RIGHT(E45,1) + RIGHT(F45,1) + RIGHT(G45,1)","v":12},{"$f":"IF(LEFT(E45,1)>RIGHT(E45,1),1,0)+IF(LEFT(F45,1)>RIGHT(F45,1),1,0)+IF(LEFT(G45,1)>RIGHT(G45,1),1,0)","v":0},{"$f":"IF(LEFT(E45,1)<RIGHT(E45,1),1,0)+IF(LEFT(F45,1)<RIGHT(F45,1),1,0)+IF(LEFT(G45,1)<RIGHT(G45,1),1,0)","v":3},4,null,"Rosca Angelo","Erster G3"]
[null,null,{"$f":"I15","v":"Philipp Grau"},{"$f":"RIGHT(E45,1) & \":\" & LEFT(E45,1)","v":"4:0"},"-","1:4","0:4",{"$f":"LEFT(D46,1) + LEFT(F46,1) + LEFT(G46,1)","v":5},{"$f":"RIGHT(D46,1) + RIGHT(F46,1) + RIGHT(G46,1)","v":8},{"$f":"IF(LEFT(D46,1)>RIGHT(D46,1),1,0)+IF(LEFT(F46,1)>RIGHT(F46,1),1,0)+IF(LEFT(G46,1)>RIGHT(G46,1),1,0)","v":1},{"$f":"IF(LEFT(D46,1)<RIGHT(D46,1),1,0)+IF(LEFT(F46,1)<RIGHT(F46,1),1,0)+IF(LEFT(G46,1)<RIGHT(G46,1),1,0)","v":2},3,null,"Rosca Leo","Zweiter G3"]
[null,null,{"$f":"I16","v":"Rosca Angelo"},{"$f":"RIGHT(F45,1) & \":\" & LEFT(F45,1)","v":"4:0"},{"$f":"RIGHT(F46,1) & \":\" & LEFT(F46,1)","v":"4:1"},"-","4:2",{"$f":"LEFT(D47,1) + LEFT(E47,1) + LEFT(G47,1)","v":12},{"$f":"RIGHT(D47,1) + RIGHT(E47,1) + RIGHT(G47,1)","v":3},{"$f":"IF(LEFT(D47,1)>RIGHT(D47,1),1,0)+IF(LEFT(E47,1)>RIGHT(E47,1),1,0)+IF(LEFT(G47,1)>RIGHT(G47,1),1,0)","v":3},{"$f":"IF(LEFT(D47,1)<RIGHT(D47,1),1,0)+IF(LEFT(E47,1)<RIGHT(E47,1),1,0)+IF(LEFT(G47,1)<RIGHT(G47,1),1,0)","v":0},1,null,"Philipp Grau","Ausgeschieden (1P)"]
[null,null,{"$f":"I17","v":"Rosca Leo"},{"$f":"RIGHT(G45,1) & \":\" & LEFT(G45,1)","v":"4:0"},{"$f":"RIGHT(G46,1) & \":\" & LEFT(G46,1)","v":"4:0"},{"$f":"RIGHT(G47,1) & \":\" & LEFT(G47,1)","v":"2:4"},"-",{"$f":"LEFT(D48,1) + LEFT(E48,1) + LEFT(F48,1)","v":10},{"$f":"RIGHT(D48,1) + RIGHT(E48,1) + RIGHT(F48,1)","v":4},{"$f":"IF(LEFT(D48,1)>RIGHT(D48,1),1,0)+IF(LEFT(E48,1)>RIGHT(E48,1),1,0)+IF(LEFT(F48,1)>RIGHT(F48,1),1,0)","v":2},{"$f":"IF(LEFT(D48,1)<RIGHT(D48,1),1,0)+IF(LEFT(E48,1)<RIGHT(E48,1),1,0)+IF(LEFT(F48,1)<RIGHT(F48,1),1,0)","v":1},2,null,"FL4","Ausgeschieden (1P)"]
[]
[null,null,"Gruppe 4",null,null,null,null,"Gewonnene Spiele","Verlorene Spiele","Gewonnene Partien","Verlorene Partien","Platz\n(manuell)",null,"Gruppensieger\n(manuell)"]
[null,null,null,{"$f":"I19","v":"FL1"},{"$f":"I20","v":"Bernd Jahnke"},{"$f":"I21","v":"Christine Neuhierl"},{"$f":"I22","v":"Rosca Daniel"}]
[null,null,{"$f":"I19","v":"FL1"},"-","0:4","0:4","0:4",{"$f":"LEFT(E52,1) + LEFT(F52,1) + LEFT(G52,1)","v":0},{"$f":"RIGHT(E52,1) + RIGHT(F52,1) + RIGHT(G52,1)","v":12},{"$f":"IF(LEFT(E52,1)>RIGHT(E52,1),1,0)+IF(LEFT(F52,1)>RIGHT(F52,1),1,0)+IF(LEFT(G52,1)>RIGHT(G52,1),1,0)","v":0},{"$f":"IF(LEFT(E52,1)<RIGHT(E52,1),1,0)+IF(LEFT(F52,1)<RIGHT(F52,1),1,0)+IF(LEFT(G52,1)<RIGHT(G52,1),1,0)","v":3},4,null,"Bernd Jahnke","Erster G4"]
[null,null,{"$f":"I20","v":"Bernd Jahnke"},{"$f":"RIGHT(E52,1) & \":\" & LEFT(E52,1)","v":"4:0"},"-","4:1","4:0",{"$f":"LEFT(D53,1) + LEFT(F53,1) + LEFT(G53,1)","v":12},{"$f":"RIGHT(D53,1) + RIGHT(F53,1) + RIGHT(G53,1)","v":1},{"$f":"IF(LEFT(D53,1)>RIGHT(D53,1),1,0)+IF(LEFT(F53,1)>RIGHT(F53,1),1,0)+IF(LEFT(G53,1)>RIGHT(G53,1),1,0)","v":3},{"$f":"IF(LEFT(D53,1)<RIGHT(D53,1),1,0)+IF(LEFT(F53,1)<RIGHT(F53,1),1,0)+IF(LEFT(G53,1)<RIGHT(G53,1),1,0)","v":0},1,null,"Daniel Rosca","Zweiter G4"]
[null,null,{"$f":"I21","v":"Christine Neuhierl"},{"$f":"RIGHT(F52,1) & \":\" & LEFT(F52,1)","v":"4:0"},{"$f":"RIGHT(F53,1) & \":\" & LEFT(F53,1)","v":"1:4"},"-","1:4",{"$f":"LEFT(D54,1) + LEFT(E54,1) + LEFT(G54,1)","v":6},{"$f":"RIGHT(D54,1) + RIGHT(E54,1) + RIGHT(G54,1)","v":8},{"$f":"IF(LEFT(D54,1)>RIGHT(D54,1),1,0)+IF(LEFT(E54,1)>RIGHT(E54,1),1,0)+IF(LEFT(G54,1)>RIGHT(G54,1),1,0)","v":1},{"$f":"IF(LEFT(D54,1)<RIGHT(D54,1),1,0)+IF(LEFT(E54,1)<RIGHT(E54,1),1,0)+IF(LEFT(G54,1)<RIGHT(G54,1),1,0)","v":2},3,null,"Christine Neuhierl","Ausgeschieden (1P)"]
[null,null,{"$f":"I22","v":"Rosca Daniel"},{"$f":"RIGHT(G52,1) & \":\" & LEFT(G52,1)","v":"4:0"},{"$f":"RIGHT(G53,1) & \":\" & LEFT(G53,1)","v":"0:4"},{"$f":"RIGHT(G54,1) & \":\" & LEFT(G54,1)","v":"4:1"},"-",{"$f":"LEFT(D55,1) + LEFT(E55,1) + LEFT(F55,1)","v":8},{"$f":"RIGHT(D55,1) + RIGHT(E55,1) + RIGHT(F55,1)","v":5},{"$f":"IF(LEFT(D55,1)>RIGHT(D55,1),1,0)+IF(LEFT(E55,1)>RIGHT(E55,1),1,0)+IF(LEFT(F55,1)>RIGHT(F55,1),1,0)","v":2},{"$f":"IF(LEFT(D55,1)<RIGHT(D55,1),1,0)+IF(LEFT(E55,1)<RIGHT(E55,1),1,0)+IF(LEFT(F55,1)<RIGHT(F55,1),1,0)","v":1},2,null,"FL1","Ausgeschieden (1P)"]
[]
[]
[null,null,"Letzte 8",null,"Spieler 1","Spieler 2","Ergebnis","Gewinner (1-4)","Verlierer (5-8 / 2P)"]
[null,"A","Erster G1","Zweiter G4",{"$f":"N31","v":"Christian Hubmann"},{"$f":"N53","v":"Daniel Rosca"},"5:2",{"$f":"IF(G59<>\"\",IF(LEFT(G59,1)>RIGHT(G59,1),E59,F59),\"-\")","v":"Christian Hubmann"},{"$f":"IF(G59<>\"\",IF(LEFT(G59,1)>RIGHT(G59,1),F59,E59),\"-\")","v":"Daniel Rosca"}]
[null,"B","Erster G2","Zweiter G3",{"$f":"N38","v":"Wolfgang Schuhmann"},{"$f":"N46","v":"Rosca Leo"},"5:1",{"$f":"IF(G60<>\"\",IF(LEFT(G60,1)>RIGHT(G60,1),E60,F60),\"-\")","v":"Wolfgang Schuhmann"},{"$f":"IF(G60<>\"\",IF(LEFT(G60,1)>RIGHT(G60,1),F60,E60),\"-\")","v":"Rosca Leo"}]
[null,"C","Erster G3","Zweiter G2",{"$f":"N45","v":"Rosca Angelo"},{"$f":"N39","v":"Harald Fröhlich"},"1:5",{"$f":"IF(G61<>\"\",IF(LEFT(G61,1)>RIGHT(G61,1),E61,F61),\"-\")","v":"Harald Fröhlich"},{"$f":"IF(G61<>\"\",IF(LEFT(G61,1)>RIGHT(G61,1),F61,E61),\"-\")","v":"Rosca Angelo"}]
[null,"D","Erster G4","Zweiter G1",{"$f":"N52","v":"Bernd Jahnke"},{"$f":"N32","v":"Noah Pülhorn"},"5:0",{"$f":"IF(G62<>\"\",IF(LEFT(G62,1)>RIGHT(G62,1),E62,F62),\"-\")","v":"Bernd Jahnke"},{"$f":"IF(G62<>\"\",IF(LEFT(G62,1)>RIGHT(G62,1),F62,E62),\"-\")","v":"Noah Pülhorn"}]
[]
[null,null,"Letzte 4",null,"Spieler 1","Spieler 2","Ergebnis","Gewinner (1/2)","Verlierer (3/4)"]
[null,"X","Gewinner A","Gewinner B",{"$f":"H59","v":"Christian Hubmann"},{"$f":"H60","v":"Wolfgang Schuhmann"},"4:7",{"$f":"IF(G65<>\"\",IF(LEFT(G65,1)>RIGHT(G65,1),E65,F65),\"-\")","v":"Wolfgang Schuhmann"},{"$f":"IF(G65<>\"\",IF(LEFT(G65,1)>RIGHT(G65,1),F65,E65),\"-\")","v":"Christian Hubmann"}]
[null,"Y","Gewinner C","Gewinner D",{"$f":"H61","v":"Harald Fröhlich"},{"$f":"H62","v":"Bernd Jahnke"},"2:7",{"$f":"IF(G66<>\"\",IF(LEFT(G66,1)>RIGHT(G66,1),E66,F66),\"-\")","v":"Bernd Jahnke"},{"$f":"IF(G66<>\"\",IF(LEFT(G66,1)>RIGHT(G66,1),F66,E66),\"-\")","v":"Harald Fröhlich"}]
[]
[null,null,"Platz 1 & 2",null,"Spieler 1","Spieler 2","Ergebnis","Gewinner (6P)","Verlierer (5P)"]
[null,null,"Gewinner X","Gewinner Y",{"$f":"H65","v":"Wolfgang Schuhmann"},{"$f":"H66","v":"Bernd Jahnke"},"7:6",{"$f":"IF(G69<>\"\",IF(LEFT(G69,1)>RIGHT(G69,1),E69,F69),\"-\")","v":"Wolfgang Schuhmann"},{"$f":"IF(G69<>\"\",IF(LEFT(G69,1)>RIGHT(G69,1),F69,E69),\"-\")","v":"Bernd Jahnke"}]
[]
[null,null,"Platz 3 & 4",null,"Spieler 1","Spieler 2","Ergebnis","Gewinner (4P)","Verlierer (3P)"]
[null,null,"Verlierer X","Verlierer Y",{"$f":"I65","v":"Christian Hubmann"},{"$f":"I66","v":"Harald Fröhlich"},"7:3",{"$f":"IF(G72<>\"\",IF(LEFT(G72,1)>RIGHT(G72,1),E72,F72),\"-\")","v":"Christian Hubmann"},{"$f":"IF(G72<>\"\",IF(LEFT(G72,1)>RIGHT(G72,1),F72,E72),\"-\")","v":"Harald Fröhlich"}]
[]
[]
[]
[null,null,"Platzierung & Preisgeld"]
[null,null,"Erster Platz ",{"$f":"H69","v":"Wolfgang Schuhmann"},{"$f":"U5","v":70}]
[null,null,"Zweiter Platz",{"$f":"I69","v":"Bernd Jahnke"},{"$f":"U6","v":50}]
[null,null,"Dritter Platz",{"$f":"H72","v":"Christian Hubmann"},{"$f":"U7","v":30}]
[null,null,"Vierter Platz",{"$f":"I72","v":"Harald Fröhlich"},{"$f":"U8","v":15}]
[]
[null,null,"Punkte der Teilnehmer"]
[null,null,{"$f":"N33","v":"FL3"},1,"Teilnahme"]
[null,null,{"$f":"N34","v":"FL5"},1]
[null,null,{"$f":"N40","v":"Monika Preuß"},1]
[null,null,{"$f":"N41","v":"FL2"},1]
[null,null,{"$f":"N47","v":"Philipp Grau"},1]
[null,null,{"$f":"N48","v":"FL4"},1]
[null,null,{"$f":"N54","v":"Christine Neuhierl"},1]
[null,null,{"$f":"N55","v":"FL1"},1]
[null,null,{"$f":"I59","v":"Daniel Rosca"},2,"Letzte 8"]
[null,null,{"$f":"I60","v":"Rosca Leo"},2]
[null,null,{"$f":"I61","v":"Rosca Angelo"},2]
[null,null,{"$f":"I62","v":"Noah Pülhorn"},2]
[null,null,{"$f":"I72","v":"Harald Fröhlich"},3,"Vierter"]
[null,null,{"$f":"H72","v":"Christian Hubmann"},4,"Dritter"]
[null,null,{"$f":"I69","v":"Bernd Jahnke"},5,"Zweiter"]
[null,null,{"$f":"H69","v":"Wolfgang Schuhmann"},6,"Erster"]

{"sheet":"Sheet1","index":1,"n_rows":14,"n_cols":1,"rows_kept":14,"cut":false,"hidden":false,"merged":[]}
["Begrüßung"]
[]
["Herzlich Willkommen"]
["Drittes Jahr - erstes Turnier im März"]
["Danke vom 6Pocket - und von mir persönlich"]
["Änderungen zum letzten Jahr:"]
["- IMMER 10er Ball, 4 Gewinnspiele, Wechselbreak"]
["- IMMER Gruppenphase bis 8 übrig sind, dann Einzel-KO"]
["- 20€ Startgebühr, 5€ in Pott für Dezember-Turnier"]
["Was bleibt gleich:"]
["- Punkte für Teilnahme & Platzierung (6/5/4/3 // 2 // 1"]
["- Anmeldung über 6pocket.de"]
["Sven ab 14.00 Uhr"]
["Auslosung - Zahl zwischen 1 und 10"]

{"sheet":"Sheet2","index":2,"n_rows":5,"n_cols":1,"rows_kept":5,"cut":false,"hidden":false,"merged":[]}
["Verbesserungen"]
[]
["Spiele gestartet / fertig"]
[]
["Tisch für Partien nach Gruppen-Phase"]