{"text_format":"1","workbook":"xlsx","n_sheets":3,"sheets":["Turnierplan 2024","Sheet1","Sheet2"],"not_rendered":{"charts":0,"images":0,"macros":1,"external_links":0,"defined_names":0,"comments":0,"pivot_tables":1},"unopened":[],"bounds":{"document_bytes":16777216,"sheet_cells":100000,"rows_first":2000,"rows_last":500,"rows_between":2000,"halvings":0,"cell_chars":16384,"cell_head_chars":4096},"cells_cut":0,"cells_raw":0,"read":"whole","date_system":"1900"}

{"sheet":"Turnierplan 2024","index":0,"n_rows":98,"n_cols":21,"rows_kept":98,"cut":false,"hidden":false,"merged":[[1,17,1,19],[1,16,2,16],[35,11,36,11],[18,1,18,5],[75,2,75,4],[49,7,50,7],[49,8,50,8],[49,9,50,9],[49,10,50,10],[49,11,50,11],[49,13,50,13],[42,7,43,7],[42,8,43,8],[42,9,43,9],[42,10,43,10],[42,11,43,11],[82,4,89,4],[90,4,93,4],[81,2,81,4],[19,1,20,6],[28,13,29,13],[35,7,36,7],[35,8,36,8],[35,9,36,9],[35,10,36,10],[35,13,36,13],[28,7,29,7],[28,8,29,8],[28,9,29,9],[28,10,29,10],[28,11,29,11],[42,13,43,13]]}
[]
[null,"No.","Name","Rand","Gruppe","Gruppe (fix)","Startgeld bezahlt",null,"Row Labels",null,null,null,null,"Datum","2024-03-17",null,null,"Teilnehmer:",null,null,15]
[null,1,"Hubsi",{"$f":"RAND()","v":0.89998869280712124},{"$f":"ROUNDUP(RANK(D3,$D$3:$D$18)/4,0)","v":2},1,"X",null,1,null,null,null,null,"Beginn","13:00:00",null,null,{"$f":"16*20","v":320},"%",{"$f":"U2*20","v":300},"Adjusted"]
[null,2,"Noah",{"$f":"RAND()","v":0.98906661765649106},1,3,"x",null,"FL1",null,null,null,null,"Ende",null,null,"Pott",{"$f":"16*5","v":80},"-",{"$f":"U2*5","v":75},{"$f":"T4","v":75}]
[null,3,"Sven",0.95350622613859748,1,4,"x",null,"Roger",1,null,null,null,null,null,null,"Erster",100,{"$f":"R5/($R$3-$R$4)","v":0.41666666666666669},{"$f":"($T$3-$T$4)*S5","v":93.75},94]
[null,4,"Wolfi",0.67215854378686402,3,2,"X",null,"Bernd",null,null,null,null,null,null,null,"Zweiter",80,{"$f":"R6/($R$3-$R$4)","v":0.33333333333333331},{"$f":"($T$3-$T$4)*S6","v":75},75]
[null,5,"Alex",0.86733060014017449,2,2,"X",null,"Andy",null,null,null,null,null,null,null,"Dritter",40,{"$f":"R7/($R$3-$R$4)","v":0.16666666666666666},{"$f":"($T$3-$T$4)*S7","v":37.5},37]
[null,6,"Erwin",0.48813748707719085,3,2,"X",null,2,null,null,null,null,null,null,null,"Vierter",20,{"$f":"R8/($R$3-$R$4)","v":8.3333333333333329E-2},{"$f":"($T$3-$T$4)*S8","v":18.75},19]
[null,7,"Bernd",7.5698197837779979E-2,4,1,"X",null,"Hubsi",null,null,null,null,null,null,null,"Total",{"$f":"SUM(R4:R8)","v":320},null,{"$f":"SUM(T4:T8)","v":300},{"$f":"SUM(U4:U8)","v":300}]
[null,8,"Phil",0.76984941010689878,3,4,"X",null,"Phil"]
[null,9,"Christine",0.80759941942759172,2,4,"X",null,"Wolfi","Gruppe 1","Gruppe 2"]
[null,10,"Markus",{"$f":"RAND()","v":9.5593750757452911E-2},4,1,"X",null,"Erwin",{"$f":"I4","v":"FL1"},{"$f":"I9","v":"Hubsi"}]
[null,11,"Joe",0.79556125684002177,2,2,"X",null,3,{"$f":"I5","v":"Roger"},{"$f":"I10","v":"Phil"}]
[null,12,"Roger",0.93815436518250572,1,3,"X",null,"Noah",{"$f":"I6","v":"Bernd"},{"$f":"I11","v":"Wolfi"}]
[null,13,"Felix",0.1779360993298158,3,3,"X",null,"Alex",{"$f":"I7","v":"Andy"},{"$f":"I12","v":"Erwin"}]
[null,14,"Andy",6.5791358090516727E-4,4,1,"x",null,"Markus","Gruppe 3","Gruppe 4"]
[null,15,"Harald",0.90938616032024477,1,4,"X",null,"Joe",{"$f":"I14","v":"Noah"},{"$f":"I19","v":"Christine"}]
[null,16,"FL1",7.3507075150557322E-2,4,3,null,null,4,{"$f":"I15","v":"Alex"},{"$f":"I20","v":"Sven"}]
[null,null,null,null,null,null,{"$f":"COUNTIF(G3:G18,\"X\")*20","v":300},null,"Christine",{"$f":"I16","v":"Markus"},{"$f":"I21","v":"Felix"}]
[null,"Manuell auszufüllen: Spieler (Spalte C), 'Platz' innerhalb der Gruppe (Spalte L), 'Gruppensieger' (Spalte N)",null,null,null,null,null,null,"Sven",{"$f":"I17","v":"Joe"},{"$f":"I22","v":"Harald"}]
[null,null,null,null,null,null,null,null,"Felix"]
[null,null,null,null,null,null,null,null,"Harald"]
[]
[]
[]
[]
[]
[]
[null,null,"Gruppe 1",null,null,null,null,"Gewonnene Spiele","Verlorene Spiele","Gewonnene Partien","Verlorene Partien","Platz\n(manuell)",null,"Gruppensieger\n(manuell)"]
[null,null,null,{"$f":"I4","v":"FL1"},{"$f":"I5","v":"Roger"},{"$f":"I6","v":"Bernd"},{"$f":"I7","v":"Andy"}]
[null,null,{"$f":"I4","v":"FL1"},"-","0:4","0:4","0:4",{"$f":"LEFT(E31,1) + LEFT(F31,1) + LEFT(G31,1)","v":0},{"$f":"RIGHT(E31,1) + RIGHT(F31,1) + RIGHT(G31,1)","v":12},{"$f":"IF(LEFT(E31,1)>RIGHT(E31,1),1,0)+IF(LEFT(F31,1)>RIGHT(F31,1),1,0)+IF(LEFT(G31,1)>RIGHT(G31,1),1,0)","v":0},{"$f":"IF(LEFT(E31,1)<RIGHT(E31,1),1,0)+IF(LEFT(F31,1)<RIGHT(F31,1),1,0)+IF(LEFT(G31,1)<RIGHT(G31,1),1,0)","v":3},4,null,"Andy","Erster G1"]
[null,null,{"$f":"I5","v":"Roger"},"4:0","-","0:4","0:;4",{"$f":"LEFT(D32,1) + LEFT(F32,1) + LEFT(G32,1)","v":4},{"$f":"RIGHT(D32,1) + RIGHT(F32,1) + RIGHT(G32,1)","v":8},{"$f":"IF(LEFT(D32,1)>RIGHT(D32,1),1,0)+IF(LEFT(F32,1)>RIGHT(F32,1),1,0)+IF(LEFT(G32,1)>RIGHT(G32,1),1,0)","v":1},{"$f":"IF(LEFT(D32,1)<RIGHT(D32,1),1,0)+IF(LEFT(F32,1)<RIGHT(F32,1),1,0)+IF(LEFT(G32,1)<RIGHT(G32,1),1,0)","v":2},3,null,"Bernd","Zweiter G1"]
[null,null,{"$f":"I6","v":"Bernd"},"4:0","4:0","-","0:4",{"$f":"LEFT(D33,1) + LEFT(E33,1) + LEFT(G33,1)","v":8},{"$f":"RIGHT(D33,1) + RIGHT(E33,1) + RIGHT(G33,1)","v":4},{"$f":"IF(LEFT(D33,1)>RIGHT(D33,1),1,0)+IF(LEFT(E33,1)>RIGHT(E33,1),1,0)+IF(LEFT(G33,1)>RIGHT(G33,1),1,0)","v":2},{"$f":"IF(LEFT(D33,1)<RIGHT(D33,1),1,0)+IF(LEFT(E33,1)<RIGHT(E33,1),1,0)+IF(LEFT(G33,1)<RIGHT(G33,1),1,0)","v":1},2,null,"Roger","Ausgeschieden (1P)"]
[null,null,{"$f":"I7","v":"Andy"},"4:0","4:0","4:0","-",{"$f":"LEFT(D34,1) + LEFT(E34,1) + LEFT(F34,1)","v":12},{"$f":"RIGHT(D34,1) + RIGHT(E34,1) + RIGHT(F34,1)","v":0},{"$f":"IF(LEFT(D34,1)>RIGHT(D34,1),1,0)+IF(LEFT(E34,1)>RIGHT(E34,1),1,0)+IF(LEFT(F34,1)>RIGHT(F34,1),1,0)","v":3},{"$f":"IF(LEFT(D34,1)<RIGHT(D34,1),1,0)+IF(LEFT(E34,1)<RIGHT(E34,1),1,0)+IF(LEFT(F34,1)<RIGHT(F34,1),1,0)","v":0},1,null,"FL1","Ausgeschieden (1P)"]
[]
[null,null,"Gruppe 2",null,null,null,null,"Gewonnene Spiele","Verlorene Spiele","Gewonnene Partien","Verlorene Partien","Platz\n(manuell)",null,"Gruppensieger\n(manuell)"]
[null,null,null,{"$f":"I9","v":"Hubsi"},{"$f":"I10","v":"Phil"},{"$f":"I11","v":"Wolfi"},{"$f":"I12","v":"Erwin"}]
[null,null,{"$f":"I9","v":"Hubsi"},"-","4:0","3:4","0:4",{"$f":"LEFT(E38,1) + LEFT(F38,1) + LEFT(G38,1)","v":7},{"$f":"RIGHT(E38,1) + RIGHT(F38,1) + RIGHT(G38,1)","v":8},{"$f":"IF(LEFT(E38,1)>RIGHT(E38,1),1,0)+IF(LEFT(F38,1)>RIGHT(F38,1),1,0)+IF(LEFT(G38,1)>RIGHT(G38,1),1,0)","v":1},{"$f":"IF(LEFT(E38,1)<RIGHT(E38,1),1,0)+IF(LEFT(F38,1)<RIGHT(F38,1),1,0)+IF(LEFT(G38,1)<RIGHT(G38,1),1,0)","v":2},3,null,"Wolfi","Erster G2"]
[null,null,{"$f":"I10","v":"Phil"},"0:4","-","0:4","2:4",{"$f":"LEFT(D39,1) + LEFT(F39,1) + LEFT(G39,1)","v":2},{"$f":"RIGHT(D39,1) + RIGHT(F39,1) + RIGHT(G39,1)","v":12},{"$f":"IF(LEFT(D39,1)>RIGHT(D39,1),1,0)+IF(LEFT(F39,1)>RIGHT(F39,1),1,0)+IF(LEFT(G39,1)>RIGHT(G39,1),1,0)","v":0},{"$f":"IF(LEFT(D39,1)<RIGHT(D39,1),1,0)+IF(LEFT(F39,1)<RIGHT(F39,1),1,0)+IF(LEFT(G39,1)<RIGHT(G39,1),1,0)","v":3},4,null,"Erwin","Zweiter G2"]
[null,null,{"$f":"I11","v":"Wolfi"},"4:3","4:0","-","4:1",{"$f":"LEFT(D40,1) + LEFT(E40,1) + LEFT(G40,1)","v":12},{"$f":"RIGHT(D40,1) + RIGHT(E40,1) + RIGHT(G40,1)","v":4},{"$f":"IF(LEFT(D40,1)>RIGHT(D40,1),1,0)+IF(LEFT(E40,1)>RIGHT(E40,1),1,0)+IF(LEFT(G40,1)>RIGHT(G40,1),1,0)","v":3},{"$f":"IF(LEFT(D40,1)<RIGHT(D40,1),1,0)+IF(LEFT(E40,1)<RIGHT(E40,1),1,0)+IF(LEFT(G40,1)<RIGHT(G40,1),1,0)","v":0},1,null,"Phil","Ausgeschieden (1P)"]
[null,null,{"$f":"I12","v":"Erwin"},"4:0","4:2","1:4","-",{"$f":"LEFT(D41,1) + LEFT(E41,1) + LEFT(F41,1)","v":9},{"$f":"RIGHT(D41,1) + RIGHT(E41,1) + RIGHT(F41,1)","v":6},{"$f":"IF(LEFT(D41,1)>RIGHT(D41,1),1,0)+IF(LEFT(E41,1)>RIGHT(E41,1),1,0)+IF(LEFT(F41,1)>RIGHT(F41,1),1,0)","v":2},{"$f":"IF(LEFT(D41,1)<RIGHT(D41,1),1,0)+IF(LEFT(E41,1)<RIGHT(E41,1),1,0)+IF(LEFT(F41,1)<RIGHT(F41,1),1,0)","v":1},2,null,"Hubsi","Ausgeschieden (1P)"]
[]
[null,null,"Gruppe 3",null,null,null,null,"Gewonnene Spiele","Verlorene Spiele","Gewonnene Partien","Verlorene Partien","Platz\n(manuell)",null,"Gruppensieger\n(manuell)"]
[null,null,null,{"$f":"I14","v":"Noah"},{"$f":"I15","v":"Alex"},{"$f":"I16","v":"Markus"},{"$f":"I17","v":"Joe"}]
[null,null,{"$f":"I14","v":"Noah"},"-","0:4","4:1","4:3",{"$f":"LEFT(E45,1) + LEFT(F45,1) + LEFT(G45,1)","v":8},{"$f":"RIGHT(E45,1) + RIGHT(F45,1) + RIGHT(G45,1)","v":8},{"$f":"IF(LEFT(E45,1)>RIGHT(E45,1),1,0)+IF(LEFT(F45,1)>RIGHT(F45,1),1,0)+IF(LEFT(G45,1)>RIGHT(G45,1),1,0)","v":2},{"$f":"IF(LEFT(E45,1)<RIGHT(E45,1),1,0)+IF(LEFT(F45,1)<RIGHT(F45,1),1,0)+IF(LEFT(G45,1)<RIGHT(G45,1),1,0)","v":1},2,null,"Alex","Erster G3"]
[null,null,{"$f":"I15","v":"Alex"},"4:0","-","4:0","4:2",{"$f":"LEFT(D46,1) + LEFT(F46,1) + LEFT(G46,1)","v":12},{"$f":"RIGHT(D46,1) + RIGHT(F46,1) + RIGHT(G46,1)","v":2},{"$f":"IF(LEFT(D46,1)>RIGHT(D46,1),1,0)+IF(LEFT(F46,1)>RIGHT(F46,1),1,0)+IF(LEFT(G46,1)>RIGHT(G46,1),1,0)","v":3},{"$f":"IF(LEFT(D46,1)<RIGHT(D46,1),1,0)+IF(LEFT(F46,1)<RIGHT(F46,1),1,0)+IF(LEFT(G46,1)<RIGHT(G46,1),1,0)","v":0},1,null,"Noah","Zweiter G3"]
[null,null,{"$f":"I16","v":"Markus"},"1:4","0:4","-","0:4",{"$f":"LEFT(D47,1) + LEFT(E47,1) + LEFT(G47,1)","v":1},{"$f":"RIGHT(D47,1) + RIGHT(E47,1) + RIGHT(G47,1)","v":12},{"$f":"IF(LEFT(D47,1)>RIGHT(D47,1),1,0)+IF(LEFT(E47,1)>RIGHT(E47,1),1,0)+IF(LEFT(G47,1)>RIGHT(G47,1),1,0)","v":0},{"$f":"IF(LEFT(D47,1)<RIGHT(D47,1),1,0)+IF(LEFT(E47,1)<RIGHT(E47,1),1,0)+IF(LEFT(G47,1)<RIGHT(G47,1),1,0)","v":3},4,null,"Markus","Ausgeschieden (1P)"]
[null,null,{"$f":"I17","v":"Joe"},"3:4","2:4","4:0","-",{"$f":"LEFT(D48,1) + LEFT(E48,1) + LEFT(F48,1)","v":9},{"$f":"RIGHT(D48,1) + RIGHT(E48,1) + RIGHT(F48,1)","v":8},{"$f":"IF(LEFT(D48,1)>RIGHT(D48,1),1,0)+IF(LEFT(E48,1)>RIGHT(E48,1),1,0)+IF(LEFT(F48,1)>RIGHT(F48,1),1,0)","v":1},{"$f":"IF(LEFT(D48,1)<RIGHT(D48,1),1,0)+IF(LEFT(E48,1)<RIGHT(E48,1),1,0)+IF(LEFT(F48,1)<RIGHT(F48,1),1,0)","v":2},3,null,"Joe","Ausgeschieden (1P)"]
[]
[null,null,"Gruppe 4",null,null,null,null,"Gewonnene Spiele","Verlorene Spiele","Gewonnene Partien","Verlorene Partien","Platz\n(manuell)",null,"Gruppensieger\n(manuell)"]
[null,null,null,{"$f":"I19","v":"Christine"},{"$f":"I20","v":"Sven"},{"$f":"I21","v":"Felix"},{"$f":"I22","v":"Harald"}]
[null,null,{"$f":"I19","v":"Christine"},"-","4:0","4:2","4:2",{"$f":"LEFT(E52,1) + LEFT(F52,1) + LEFT(G52,1)","v":12},{"$f":"RIGHT(E52,1) + RIGHT(F52,1) + RIGHT(G52,1)","v":4},{"$f":"IF(LEFT(E52,1)>RIGHT(E52,1),1,0)+IF(LEFT(F52,1)>RIGHT(F52,1),1,0)+IF(LEFT(G52,1)>RIGHT(G52,1),1,0)","v":3},{"$f":"IF(LEFT(E52,1)<RIGHT(E52,1),1,0)+IF(LEFT(F52,1)<RIGHT(F52,1),1,0)+IF(LEFT(G52,1)<RIGHT(G52,1),1,0)","v":0},1,null,"Christine","Erster G4"]
[null,null,{"$f":"I20","v":"Sven"},"0:4","-","4:0","4:1",{"$f":"LEFT(D53,1) + LEFT(F53,1) + LEFT(G53,1)","v":8},{"$f":"RIGHT(D53,1) + RIGHT(F53,1) + RIGHT(G53,1)","v":5},{"$f":"IF(LEFT(D53,1)>RIGHT(D53,1),1,0)+IF(LEFT(F53,1)>RIGHT(F53,1),1,0)+IF(LEFT(G53,1)>RIGHT(G53,1),1,0)","v":2},{"$f":"IF(LEFT(D53,1)<RIGHT(D53,1),1,0)+IF(LEFT(F53,1)<RIGHT(F53,1),1,0)+IF(LEFT(G53,1)<RIGHT(G53,1),1,0)","v":1},2,null,"Sven","Zweiter G4"]
[null,null,{"$f":"I21","v":"Felix"},"2:4","0:4","-","2:4",{"$f":"LEFT(D54,1) + LEFT(E54,1) + LEFT(G54,1)","v":4},{"$f":"RIGHT(D54,1) + RIGHT(E54,1) + RIGHT(G54,1)","v":12},{"$f":"IF(LEFT(D54,1)>RIGHT(D54,1),1,0)+IF(LEFT(E54,1)>RIGHT(E54,1),1,0)+IF(LEFT(G54,1)>RIGHT(G54,1),1,0)","v":0},{"$f":"IF(LEFT(D54,1)<RIGHT(D54,1),1,0)+IF(LEFT(E54,1)<RIGHT(E54,1),1,0)+IF(LEFT(G54,1)<RIGHT(G54,1),1,0)","v":3},4,null,"Felix","Ausgeschieden (1P)"]
[null,null,{"$f":"I22","v":"Harald"},"2:4","1:4","4:2","-",{"$f":"LEFT(D55,1) + LEFT(E55,1) + LEFT(F55,1)","v":7},{"$f":"RIGHT(D55,1) + RIGHT(E55,1) + RIGHT(F55,1)","v":10},{"$f":"IF(LEFT(D55,1)>RIGHT(D55,1),1,0)+IF(LEFT(E55,1)>RIGHT(E55,1),1,0)+IF(LEFT(F55,1)>RIGHT(F55,1),1,0)","v":1},{"$f":"IF(LEFT(D55,1)<RIGHT(D55,1),1,0)+IF(LEFT(E55,1)<RIGHT(E55,1),1,0)+IF(LEFT(F55,1)<RIGHT(F55,1),1,0)","v":2},3,null,"Harald","Ausgeschieden (1P)"]
[]
[]
[null,null,"Letzte 8",null,"Spieler 1","Spieler 2","Ergebnis","Gewinner (1-4)","Verlierer (5-8 / 2P)"]
[null,"A","Erster G1","Zweiter G4",{"$f":"N31","v":"Andy"},{"$f":"N53","v":"Sven"},"5:3",{"$f":"IF(LEFT(G59,1)>RIGHT(G59,1),E59,F59)","v":"Andy"},{"$f":"IF(LEFT(G59,1)>RIGHT(G59,1),F59,E59)","v":"Sven"}]
[null,"B","Erster G2","Zweiter G3",{"$f":"N38","v":"Wolfi"},{"$f":"N46","v":"Noah"},"5:1",{"$f":"IF(LEFT(G60,1)>RIGHT(G60,1),E60,F60)","v":"Wolfi"},{"$f":"IF(LEFT(G60,1)>RIGHT(G60,1),F60,E60)","v":"Noah"}]
[null,"C","Erster G3","Zweiter G2",{"$f":"N45","v":"Alex"},{"$f":"N39","v":"Erwin"},"5:0","Alex","Erwin"]
[null,"D","Erster G4","Zweiter G1",{"$f":"N52","v":"Christine"},{"$f":"N32","v":"Bernd"},"1:5","Bernd","Christine"]
[]
[null,null,"Letzte 4",null,"Spieler 1","Spieler 2","Ergebnis","Gewinner (1/2)","Verlierer (3/4)"]
[null,"X","Gewinner A","Gewinner B",{"$f":"H59","v":"Andy"},{"$f":"H60","v":"Wolfi"},"6:3",{"$f":"IF(LEFT(G65,1)>RIGHT(G65,1),E65,F65)","v":"Andy"},{"$f":"IF(LEFT(G65,1)>RIGHT(G65,1),F65,E65)","v":"Wolfi"}]
[null,"Y","Gewinner C","Gewinner D",{"$f":"H61","v":"Alex"},{"$f":"H62","v":"Bernd"},"0:6",{"$f":"IF(LEFT(G66,1)>RIGHT(G66,1),E66,F66)","v":"Bernd"},{"$f":"IF(LEFT(G66,1)>RIGHT(G66,1),F66,E66)","v":"Alex"}]
[]
[null,null,"Platz 1 & 2",null,"Spieler 1","Spieler 2","Ergebnis","Gewinner (6P)","Verlierer (5P)"]
[null,null,"Gewinner X","Gewinner Y",{"$f":"H65","v":"Andy"},{"$f":"H66","v":"Bernd"},"7:3",{"$f":"IF(LEFT(G69,1)>RIGHT(G69,1),E69,F69)","v":"Andy"},{"$f":"IF(LEFT(G69,1)>RIGHT(G69,1),F69,E69)","v":"Bernd"}]
[]
[null,null,"Platz 3 & 4",null,"Spieler 1","Spieler 2","Ergebnis","Gewinner (4P)","Verlierer (3P)"]
[null,null,"Verlierer X","Verlierer Y",{"$f":"I65","v":"Wolfi"},{"$f":"I66","v":"Alex"},"7:0",{"$f":"IF(LEFT(G72,1)>RIGHT(G72,1),E72,F72)","v":"Wolfi"},{"$f":"IF(LEFT(G72,1)>RIGHT(G72,1),F72,E72)","v":"Alex"}]
[]
[]
[]
[null,null,"Platzierung & Preisgeld"]
[null,null,"Erster Platz ",{"$f":"H69","v":"Andy"},{"$f":"U5","v":94}]
[null,null,"Zweiter Platz",{"$f":"I69","v":"Bernd"},{"$f":"U6","v":75}]
[null,null,"Dritter Platz",{"$f":"H72","v":"Wolfi"},{"$f":"U7","v":37}]
[null,null,"Vierter Platz",{"$f":"I72","v":"Alex"},{"$f":"U8","v":19}]
[]
[null,null,"Punkte der Teilnehmer"]
[null,null,{"$f":"N33","v":"Roger"},1,"Teilnahme"]
[null,null,{"$f":"N34","v":"FL1"},1]
[null,null,{"$f":"N40","v":"Phil"},1]
[null,null,{"$f":"N41","v":"Hubsi"},1]
[null,null,{"$f":"N47","v":"Markus"},1]
[null,null,{"$f":"N48","v":"Joe"},1]
[null,null,{"$f":"N54","v":"Felix"},1]
[null,null,{"$f":"N55","v":"Harald"},1]
[null,null,{"$f":"I59","v":"Sven"},2,"Letzte 8"]
[null,null,{"$f":"I60","v":"Noah"},2]
[null,null,{"$f":"I61","v":"Erwin"},2]
[null,null,{"$f":"I62","v":"Christine"},2]
[null,null,{"$f":"I72","v":"Alex"},3,"Vierter"]
[null,null,{"$f":"H72","v":"Wolfi"},4,"Dritter"]
[null,null,{"$f":"I69","v":"Bernd"},5,"Zweiter"]
[null,null,{"$f":"H69","v":"Andy"},6,"Erster"]

{"sheet":"Sheet1","index":1,"n_rows":14,"n_cols":1,"rows_kept":14,"cut":false,"hidden":false,"merged":[]}
["Begrüßung"]
[]
["Herzlich Willkommen"]
["Drittes Jahr - erstes Turnier im März"]
["Danke vom 6Pocket - und von mir persönlich"]
["Änderungen zum letzten Jahr:"]
["- IMMER 10er Ball, 4 Gewinnspiele, Wechselbreak"]
["- IMMER Gruppenphase bis 8 übrig sind, dann Einzel-KO"]
["- 20€ Startgebühr, 5€ in Pott für Dezember-Turnier"]
["Was bleibt gleich:"]
["- Punkte für Teilnahme & Platzierung (6/5/4/3 // 2 // 1"]
["- Anmeldung über 6pocket.de"]
["Sven ab 14.00 Uhr"]
["Auslosung - Zahl zwischen 1 und 10"]

{"sheet":"Sheet2","index":2,"n_rows":6,"n_cols":1,"rows_kept":6,"cut":false,"hidden":false,"merged":[]}
["Verbesserungen"]
[]
["Spiele gestartet / fertig"]
["FL auto-ausfüllen"]
["Tisch für Partien nach Gruppen-Phase"]
["Gespiegelte Ergebnisse autom. Eintragen"]